{"text_format":"1","workbook":"xlsx","n_sheets":3,"sheets":["Lookup","Subject raw marks data","Scaling Calculator"],"not_rendered":{"charts":0,"images":1,"macros":1,"external_links":0,"defined_names":261,"comments":0,"pivot_tables":0},"unopened":[],"bounds":{"document_bytes":16777216,"sheet_cells":100000,"rows_first":2000,"rows_last":500,"rows_between":2000,"halvings":0,"cell_chars":16384,"cell_head_chars":4096},"cells_cut":0,"cells_raw":0,"read":"whole","date_system":"1900"}

{"sheet":"Lookup","index":0,"n_rows":204,"n_cols":67,"rows_kept":204,"cut":false,"hidden":true,"merged":[]}
["Subject","Qualification","Component","Scaling",null,null,"English Literature","8ET0","GCSE","Subject AS Level","Subject A level","Subject GCSE","English Literature","English Language","English Language and Literature","French","German","Spanish","Economics A","Economics B","Business","Physical Education","Art and Design","Psychology","Drama and Theatre","Chinese","Italian","Russian","Music","Gujarati","Arabic","Greek","Japanese","Persian","Portuguese","Turkish","Urdu","English Literature","French","German","Spanish","Physical Education","Drama and Theatre","Chinese","Italian","Russian","Music Technology","Art and Design","Computer Science","Drama","Physical Education","French","German","Spanish","Arabic","Chinese","Greek","Italian","Japanese","Russian","Urdu","Geography A","Geography B","Gujarati","Persian","Portuguese","Turkish"]
["English Literature","8ET0",1,1,null,null,"English Literature","9ET0","AS level","Chinese","Arabic","Arabic","9ET0","9EN0","9EL0","9FR0","9GN0","9SP0","9EC0","9EB0","9BS0","9PE0","9AD0","9PS0","9DR0","9CN0","9IN0","9RU0","9MU0","9GU0","9AA0","9GK0","9JA0","9PN0","9PG0","9TU0","9UR0","8ET0","8FR0","8GN0","8SP0","8PE0","8DR0","8CN0","8IN0","8RU0","8MT0","1AD0","1CP1","1DR0","1PE0","1FR0","1GN0","1SP0","1AA0","1CN0","1GK0","1IN0","1JA0","1RU0","1UR0","1GA0","1GB0","1GU0","1PN0","1PG0","1TU0"]
["English Literature","8ET0",2,1.091,null,null,"English Language","9EN0","A level","Drama and Theatre","Art and Design","Art and Design",null,null,null,null,null,null,null,null,null,null,"9FA0",null,null,null,null,null,null,null,null,null,null,null,null,null,null,null,null,null,null,null,null,null,null,null,null,"1FA0",null,null,"3PE0"]
["English Literature","9ET0",1,1.5,null,null,"English Language and Literature","9EL0",null,"English Literature","Business","Chinese",null,null,null,null,null,null,null,null,null,null,"9GC0",null,null,null,null,null,null,null,null,null,null,null,null,null,null,null,null,null,null,null,null,null,null,null,null,"1GC0"]
["English Literature","9ET0",2,1.5,null,null,"French","8FR0",null,"French","Chinese","Computer Science",null,null,null,null,null,null,null,null,null,null,"9PY0",null,null,null,null,null,null,null,null,null,null,null,null,null,null,null,null,null,null,null,null,null,null,null,null,"1PY0"]
["English Literature","9ET0",3,1.5,null,null,"German","8GN0",null,"German","Drama and Theatre","Drama",null,null,null,null,null,null,null,null,null,null,"9TD0",null,null,null,null,null,null,null,null,null,null,null,null,null,null,null,null,null,null,null,null,null,null,null,null,"1TD0"]
["English Literature","9ET0",4,1,null,null,"Spanish","8SP0",null,"Italian","Economics A","French",null,null,null,null,null,null,null,null,null,null,"9TE0",null,null,null,null,null,null,null,null,null,null,null,null,null,null,null,null,null,null,null,null,null,null,null,null,"1TE0"]
["English Language","9EN0",1,1.458,null,null,"Economics A","9EC0",null,"Music Technology","Economics B","Geography A"]
["English Language","9EN0",2,1.111,null,null,"Economics B","9EB0",null,"Physical Education","English Language","Geography B"]
["English Language","9EN0",3,1.389,null,null,"Business","9BS0",null,"Russian","English Language and Literature","German"]
["English Language","9EN0",4,1,null,null,"Physical Education","8PE0",null,"Spanish","English Literature","Greek"]
["English Language and Literature","9EL0",1,2.4,null,null,"Physical Education","9PE0",null,null,"French","Gujarati"]
["English Language and Literature","9EL0",2,2.4,null,null,"Art and Design","9AD0",null,null,"German","Italian"]
["English Language and Literature","9EL0",3,1,null,null,"Art and Design","9FA0",null,null,"Greek","Japanese"]
["French","8FR0",1,1.5,64,null,"Art and Design","9GC0",null,null,"Gujarati","Persian"]
["French","8FR0",2,1.2,60,null,"Art and Design","9PY0",null,null,"Italian","Physical Education"]
["French","8FR0",3,1,72,null,"Art and Design","9TD0",null,null,"Japanese","Portuguese"]
["German","8GN0",1,1.5,null,null,"Art and Design","9TE0",null,null,"Music","Russian"]
["German","8GN0",2,1.2,null,null,"Psychology","9PS0",null,null,"Persian","Spanish"]
["German","8GN0",3,1,null,null,"Drama and Theatre","8DR0",null,null,"Physical Education","Turkish"]
{"$rows_left_out":185}
{"sheet":"Subject raw marks data","index":1,"n_rows":142,"n_cols":203,"rows_kept":142,"cut":false,"hidden":true,"merged":[]}
["1AA0 Comp 1","1AA0 Comp 2","1AA0 Comp 3","1AA0 Comp 4","1AD0 Comp 1","1AD0 Comp 2","1CN0 Comp 1","1CN0 Comp 2","1CN0 Comp 3","1CN0 Comp 4","1CP1 Comp 1","1CP1 Comp 2","1CP1 Comp 3","1DR0 Comp 1","1DR0 Comp 2","1DR0 Comp 3","1FA0 Comp 1","1FA0 Comp 2","1FR0 Comp 1","1FR0 Comp 2","1FR0 Comp 3","1FR0 Comp 4","1GA0 Comp 1","1GA0 Comp 2","1GA0 Comp 3","1GB0 Comp 1","1GB0 Comp 2","1GB0 Comp 3","1GC0 Comp 1","1GC0 Comp 2","1GK0 Comp 1","1GK0 Comp 2","1GK0 Comp 3","1GK0 Comp 4","1GN0 Comp 1","1GN0 Comp 2","1GN0 Comp 3","1GN0 Comp 4","1GU0 Comp 1","1GU0 Comp 2","1GU0 Comp 3","1GU0 Comp 4","1IN0 Comp 1","1IN0 Comp 2","1IN0 Comp 3","1IN0 Comp 4","1JA0 Comp 1","1JA0 Comp 2","1JA0 Comp 3","1JA0 Comp 4","1PE0 Comp 1","1PE0 Comp 2","1PE0 Comp 3","1PE0 Comp 4","1PG0 Comp 1","1PG0 Comp 2","1PG0 Comp 3","1PG0 Comp 4","1PN0 Comp 1","1PN0 Comp 2","1PN0 Comp 3","1PN0 Comp 4","1PY0 Comp 1","1PY0 Comp 2","1RU0 Comp 1","1RU0 Comp 2","1RU0 Comp 3","1RU0 Comp 4","1SP0 Comp 1","1SP0 Comp 2","1SP0 Comp 3","1SP0 Comp 4","1TD0 Comp 1","1TD0 Comp 2","1TE0 Comp 1","1TE0 Comp 2","1TU0 Comp 1","1TU0 Comp 2","1TU0 Comp 3","1TU0 Comp 4","1UR0 Comp 1","1UR0 Comp 2","1UR0 Comp 3","1UR0 Comp 4","3PE0 Comp 1","3PE0 Comp 2","8CN0 Comp 1","8CN0 Comp 2","8CN0 Comp 3","8DR0 Comp 1","8DR0 Comp 2","8ET0 Comp 1","8ET0 Comp 2","8FR0 Comp 1","8FR0 Comp 2","8FR0 Comp 3","8GN0 Comp 1","8GN0 Comp 2","8GN0 Comp 3","8IN0 Comp 1","8IN0 Comp 2","8IN0 Comp 3","8MT0 Comp 1","8MT0 Comp 2","8MT0 Comp 3","8MT0 Comp 4","8PE0 Comp 1","8PE0 Comp 2","8PE0 Comp 3","8PE0 Comp 4","8RU0 Comp 1","8RU0 Comp 2","8RU0 Comp 3","8SP0 Comp 1","8SP0 Comp 2","8SP0 Comp 3","9AA0 Comp 1","9AA0 Comp 2","9AA0 Comp 3","9AD0 Comp 1","9AD0 Comp 2","9BS0 Comp 1","9BS0 Comp 2","9BS0 Comp 3","9CN0 Comp 1","9CN0 Comp 2","9CN0 Comp 3","9DR0 Comp 1","9DR0 Comp 2","9DR0 Comp 3","9EB0 Comp 1","9EB0 Comp 2","9EB0 Comp 3","9EC0 Comp 1","9EC0 Comp 2","9EC0 Comp 3","9EL0 Comp 1","9EL0 Comp 2","9EL0 Comp 3","9EN0 Comp 1","9EN0 Comp 2","9EN0 Comp 3","9EN0 Comp 4","9ET0 Comp 1","9ET0 Comp 2","9ET0 Comp 3","9ET0 Comp 4","9FA0 Comp 1","9FA0 Comp 2","9FR0 Comp 1","9FR0 Comp 2","9FR0 Comp 3","9GC0 Comp 1","9GC0 Comp 2","9GK0 Comp 1","9GK0 Comp 2","9GK0 Comp 3","9GN0 Comp 1","9GN0 Comp 2","9GN0 Comp 3","9GU0 Comp 1","9GU0 Comp 2","9GU0 Comp 3","9IN0 Comp 1","9IN0 Comp 2","9IN0 Comp 3","9JA0 Comp 1","9JA0 Comp 2","9JA0 Comp 3","9MU0 Comp 1","9MU0 Comp 2","9MU0 Comp 3","9PE0 Comp 1","9PE0 Comp 2","9PE0 Comp 3","9PE0 Comp 4","9PG0 Comp 1","9PG0 Comp 2","9PG0 Comp 3","9PN0 Comp 1","9PN0 Comp 2","9PN0 Comp 3","9PS0 Comp 1","9PS0 Comp 2","9PS0 Comp 3","9PY0 Comp 1","9PY0 Comp 2","9RU0 Comp 1","9RU0 Comp 2","9RU0 Comp 3","9SP0 Comp 1","9SP0 Comp 2","9SP0 Comp 3","9TD0 Comp 1","9TD0 Comp 2","9TE0 Comp 1","9TE0 Comp 2","9TU0 Comp 1","9TU0 Comp 2","9TU0 Comp 3","9UR0 Comp 1","9UR0 Comp 2","9UR0 Comp 3"]
[0,0,0,0,0,0,0,0,0,0,0,0,0,0,0,0,0,0,0,0,0,0,0,0,0,0,0,0,0,0,0,0,0,0,0,0,0,0,0,0,0,0,0,0,0,0,0,0,0,0,0,0,0,0,0,0,0,0,0,0,0,0,0,0,0,0,0,0,0,0,0,0,0,0,0,0,0,0,0,0,0,0,0,0,0,0,0,0,0,0,0,0,0,0,0,0,0,0,0,0,0,0,0,0,0,0,0,0,0,0,0,0,0,0,0,0,0,0,0,0,0,0,0,0,0,0,0,0,0,0,0,0,0,0,0,0,0,0,0,0,0,0,0,0,0,0,0,0,0,0,0,0,0,0,0,0,0,0,0,0,0,0,0,0,0,0,0,0,0,0,0,0,0,0,0,0,0,0,0,0,0,0,0,0,0,0,0,0,0,0,0,0,0,0,0,0,0,0,0,0,0,0,0]
[1,1,1,1,1,1,1,1,1,1,1,1,1,1,1,1,1,1,1,1,1,1,1,1,1,1,1,1,1,1,1,1,1,1,1,1,1,1,1,1,1,1,1,1,1,1,1,1,1,1,1,1,1,1,1,1,1,1,1,1,1,1,1,1,1,1,1,1,1,1,1,1,1,1,1,1,1,1,1,1,1,1,1,1,1,1,1,1,1,1,1,1,1,1,1,1,1,1,1,1,1,1,1,1,1,1,1,1,1,1,1,1,1,1,1,1,1,1,1,1,1,1,1,1,1,1,1,1,1,1,1,1,1,1,1,1,1,1,1,1,1,1,1,1,1,1,1,1,1,1,1,1,1,1,1,1,1,1,1,1,1,1,1,1,1,1,1,1,1,1,1,1,1,1,1,1,1,1,1,1,1,1,1,1,1,1,1,1,1,1,1,1,1,1,1,1,1,1,1,1,1,1,1]
[2,2,2,2,2,2,2,2,2,2,2,2,2,2,2,2,2,2,2,2,2,2,2,2,2,2,2,2,2,2,2,2,2,2,2,2,2,2,2,2,2,2,2,2,2,2,2,2,2,2,2,2,2,2,2,2,2,2,2,2,2,2,2,2,2,2,2,2,2,2,2,2,2,2,2,2,2,2,2,2,2,2,2,2,2,2,2,2,2,2,2,2,2,2,2,2,2,2,2,2,2,2,2,2,2,2,2,2,2,2,2,2,2,2,2,2,2,2,2,2,2,2,2,2,2,2,2,2,2,2,2,2,2,2,2,2,2,2,2,2,2,2,2,2,2,2,2,2,2,2,2,2,2,2,2,2,2,2,2,2,2,2,2,2,2,2,2,2,2,2,2,2,2,2,2,2,2,2,2,2,2,2,2,2,2,2,2,2,2,2,2,2,2,2,2,2,2,2,2,2,2,2,2]
[3,3,3,3,3,3,3,3,3,3,3,3,3,3,3,3,3,3,3,3,3,3,3,3,3,3,3,3,3,3,3,3,3,3,3,3,3,3,3,3,3,3,3,3,3,3,3,3,3,3,3,3,3,3,3,3,3,3,3,3,3,3,3,3,3,3,3,3,3,3,3,3,3,3,3,3,3,3,3,3,3,3,3,3,3,3,3,3,3,3,3,3,3,3,3,3,3,3,3,3,3,3,3,3,3,3,3,3,3,3,3,3,3,3,3,3,3,3,3,3,3,3,3,3,3,3,3,3,3,3,3,3,3,3,3,3,3,3,3,3,3,3,3,3,3,3,3,3,3,3,3,3,3,3,3,3,3,3,3,3,3,3,3,3,3,3,3,3,3,3,3,3,3,3,3,3,3,3,3,3,3,3,3,3,3,3,3,3,3,3,3,3,3,3,3,3,3,3,3,3,3,3,3]
[4,4,4,4,4,4,4,4,4,4,4,4,4,4,4,4,4,4,4,4,4,4,4,4,4,4,4,4,4,4,4,4,4,4,4,4,4,4,4,4,4,4,4,4,4,4,4,4,4,4,4,4,4,4,4,4,4,4,4,4,4,4,4,4,4,4,4,4,4,4,4,4,4,4,4,4,4,4,4,4,4,4,4,4,4,4,4,4,4,4,4,4,4,4,4,4,4,4,4,4,4,4,4,4,4,4,4,4,4,4,4,4,4,4,4,4,4,4,4,4,4,4,4,4,4,4,4,4,4,4,4,4,4,4,4,4,4,4,4,4,4,4,4,4,4,4,4,4,4,4,4,4,4,4,4,4,4,4,4,4,4,4,4,4,4,4,4,4,4,4,4,4,4,4,4,4,4,4,4,4,4,4,4,4,4,4,4,4,4,4,4,4,4,4,4,4,4,4,4,4,4,4,4]
[5,5,5,5,5,5,5,5,5,5,5,5,5,5,5,5,5,5,5,5,5,5,5,5,5,5,5,5,5,5,5,5,5,5,5,5,5,5,5,5,5,5,5,5,5,5,5,5,5,5,5,5,5,5,5,5,5,5,5,5,5,5,5,5,5,5,5,5,5,5,5,5,5,5,5,5,5,5,5,5,5,5,5,5,5,5,5,5,5,5,5,5,5,5,5,5,5,5,5,5,5,5,5,5,5,5,5,5,5,5,5,5,5,5,5,5,5,5,5,5,5,5,5,5,5,5,5,5,5,5,5,5,5,5,5,5,5,5,5,5,5,5,5,5,5,5,5,5,5,5,5,5,5,5,5,5,5,5,5,5,5,5,5,5,5,5,5,5,5,5,5,5,5,5,5,5,5,5,5,5,5,5,5,5,5,5,5,5,5,5,5,5,5,5,5,5,5,5,5,5,5,5,5]
[6,6,6,6,6,6,6,6,6,6,6,6,6,6,6,6,6,6,6,6,6,6,6,6,6,6,6,6,6,6,6,6,6,6,6,6,6,6,6,6,6,6,6,6,6,6,6,6,6,6,6,6,6,6,6,6,6,6,6,6,6,6,6,6,6,6,6,6,6,6,6,6,6,6,6,6,6,6,6,6,6,6,6,6,6,6,6,6,6,6,6,6,6,6,6,6,6,6,6,6,6,6,6,6,6,6,6,6,6,6,6,6,6,6,6,6,6,6,6,6,6,6,6,6,6,6,6,6,6,6,6,6,6,6,6,6,6,6,6,6,6,6,6,6,6,6,6,6,6,6,6,6,6,6,6,6,6,6,6,6,6,6,6,6,6,6,6,6,6,6,6,6,6,6,6,6,6,6,6,6,6,6,6,6,6,6,6,6,6,6,6,6,6,6,6,6,6,6,6,6,6,6,6]
[7,7,7,7,7,7,7,7,7,7,7,7,7,7,7,7,7,7,7,7,7,7,7,7,7,7,7,7,7,7,7,7,7,7,7,7,7,7,7,7,7,7,7,7,7,7,7,7,7,7,7,7,7,7,7,7,7,7,7,7,7,7,7,7,7,7,7,7,7,7,7,7,7,7,7,7,7,7,7,7,7,7,7,7,7,7,7,7,7,7,7,7,7,7,7,7,7,7,7,7,7,7,7,7,7,7,7,7,7,7,7,7,7,7,7,7,7,7,7,7,7,7,7,7,7,7,7,7,7,7,7,7,7,7,7,7,7,7,7,7,7,7,7,7,7,7,7,7,7,7,7,7,7,7,7,7,7,7,7,7,7,7,7,7,7,7,7,7,7,7,7,7,7,7,7,7,7,7,7,7,7,7,7,7,7,7,7,7,7,7,7,7,7,7,7,7,7,7,7,7,7,7,7]
[8,8,8,8,8,8,8,8,8,8,8,8,8,8,8,8,8,8,8,8,8,8,8,8,8,8,8,8,8,8,8,8,8,8,8,8,8,8,8,8,8,8,8,8,8,8,8,8,8,8,8,8,8,8,8,8,8,8,8,8,8,8,8,8,8,8,8,8,8,8,8,8,8,8,8,8,8,8,8,8,8,8,8,8,8,8,8,8,8,8,8,8,8,8,8,8,8,8,8,8,8,8,8,8,8,8,8,8,8,8,8,8,8,8,8,8,8,8,8,8,8,8,8,8,8,8,8,8,8,8,8,8,8,8,8,8,8,8,8,8,8,8,8,8,8,8,8,8,8,8,8,8,8,8,8,8,8,8,8,8,8,8,8,8,8,8,8,8,8,8,8,8,8,8,8,8,8,8,8,8,8,8,8,8,8,8,8,8,8,8,8,8,8,8,8,8,8,8,8,8,8,8,8]
[9,9,9,9,9,9,9,9,9,9,9,9,9,9,9,9,9,9,9,9,9,9,9,9,9,9,9,9,9,9,9,9,9,9,9,9,9,9,9,9,9,9,9,9,9,9,9,9,9,9,9,9,9,9,9,9,9,9,9,9,9,9,9,9,9,9,9,9,9,9,9,9,9,9,9,9,9,9,9,9,9,9,9,9,9,9,9,9,9,9,9,9,9,9,9,9,9,9,9,9,9,9,9,9,9,9,9,9,9,9,9,9,9,9,9,9,9,9,9,9,9,9,9,9,9,9,9,9,9,9,9,9,9,9,9,9,9,9,9,9,9,9,9,9,9,9,9,9,9,9,9,9,9,9,9,9,9,9,9,9,9,9,9,9,9,9,9,9,9,9,9,9,9,9,9,9,9,9,9,9,9,9,9,9,9,9,9,9,9,9,9,9,9,9,9,9,9,9,9,9,9,9,9]
[10,10,10,10,10,10,10,10,10,10,10,10,10,10,10,10,10,10,10,10,10,10,10,10,10,10,10,10,10,10,10,10,10,10,10,10,10,10,10,10,10,10,10,10,10,10,10,10,10,10,10,10,10,10,10,10,10,10,10,10,10,10,10,10,10,10,10,10,10,10,10,10,10,10,10,10,10,10,10,10,10,10,10,10,10,10,10,10,10,10,10,10,10,10,10,10,10,10,10,10,10,10,10,10,10,10,10,10,10,10,10,10,10,10,10,10,10,10,10,10,10,10,10,10,10,10,10,10,10,10,10,10,10,10,10,10,10,10,10,10,10,10,10,10,10,10,10,10,10,10,10,10,10,10,10,10,10,10,10,10,10,10,10,10,10,10,10,10,10,10,10,10,10,10,10,10,10,10,10,10,10,10,10,10,10,10,10,10,10,10,10,10,10,10,10,10,10,10,10,10,10,10,10]
[11,11,11,11,11,11,11,11,11,11,11,11,11,11,11,11,11,11,11,11,11,11,11,11,11,11,11,11,11,11,11,11,11,11,11,11,11,11,11,11,11,11,11,11,11,11,11,11,11,11,11,11,11,11,11,11,11,11,11,11,11,11,11,11,11,11,11,11,11,11,11,11,11,11,11,11,11,11,11,11,11,11,11,11,11,11,11,11,11,11,11,11,11,11,11,11,11,11,11,11,11,11,11,11,11,11,11,11,11,11,11,11,11,11,11,11,11,11,11,11,11,11,11,11,11,11,11,11,11,11,11,11,11,11,11,11,11,11,11,11,11,11,11,11,11,11,11,11,11,11,11,11,11,11,11,11,11,11,11,11,11,11,11,11,11,11,11,11,11,11,11,11,11,11,11,11,11,11,11,11,11,11,11,11,11,11,11,11,11,11,11,11,11,11,11,11,11,11,11,11,11,11,11]
[12,12,12,12,12,12,12,12,12,12,12,12,12,12,12,12,12,12,12,12,12,12,12,12,12,12,12,12,12,12,12,12,12,12,12,12,12,12,12,12,12,12,12,12,12,12,12,12,12,12,12,12,12,12,12,12,12,12,12,12,12,12,12,12,12,12,12,12,12,12,12,12,12,12,12,12,12,12,12,12,12,12,12,12,12,12,12,12,12,12,12,12,12,12,12,12,12,12,12,12,12,12,12,12,12,12,12,12,12,12,12,12,12,12,12,12,12,12,12,12,12,12,12,12,12,12,12,12,12,12,12,12,12,12,12,12,12,12,12,12,12,12,12,12,12,12,12,12,12,12,12,12,12,12,12,12,12,12,12,12,12,12,12,12,12,12,12,12,12,12,12,12,12,12,12,12,12,12,12,12,12,12,12,12,12,12,12,12,12,12,12,12,12,12,12,12,12,12,12,12,12,12,12]
[13,13,13,13,13,13,13,13,13,13,13,13,13,13,13,13,13,13,13,13,13,13,13,13,13,13,13,13,13,13,13,13,13,13,13,13,13,13,13,13,13,13,13,13,13,13,13,13,13,13,13,13,13,13,13,13,13,13,13,13,13,13,13,13,13,13,13,13,13,13,13,13,13,13,13,13,13,13,13,13,13,13,13,13,13,13,13,13,13,13,13,13,13,13,13,13,13,13,13,13,13,13,13,13,13,13,13,13,13,13,13,13,13,13,13,13,13,13,13,13,13,13,13,13,13,13,13,13,13,13,13,13,13,13,13,13,13,13,13,13,13,13,13,13,13,13,13,13,13,13,13,13,13,13,13,13,13,13,13,13,13,13,13,13,13,13,13,13,13,13,13,13,13,13,13,13,13,13,13,13,13,13,13,13,13,13,13,13,13,13,13,13,13,13,13,13,13,13,13,13,13,13,13]
[14,14,14,14,14,14,14,14,14,14,14,14,14,14,14,14,14,14,14,14,14,14,14,14,14,14,14,14,14,14,14,14,14,14,14,14,14,14,14,14,14,14,14,14,14,14,14,14,14,14,14,14,14,14,14,14,14,14,14,14,14,14,14,14,14,14,14,14,14,14,14,14,14,14,14,14,14,14,14,14,14,14,14,14,14,14,14,14,14,14,14,14,14,14,14,14,14,14,14,14,14,14,14,14,14,14,14,14,14,14,14,14,14,14,14,14,14,14,14,14,14,14,14,14,14,14,14,14,14,14,14,14,14,14,14,14,14,14,14,14,14,14,14,14,14,14,14,14,14,14,14,14,14,14,14,14,14,14,14,14,14,14,14,14,14,14,14,14,14,14,14,14,14,14,14,14,14,14,14,14,14,14,14,14,14,14,14,14,14,14,14,14,14,14,14,14,14,14,14,14,14,14,14]
[15,15,15,15,15,15,15,15,15,15,15,15,15,15,15,15,15,15,15,15,15,15,15,15,15,15,15,15,15,15,15,15,15,15,15,15,15,15,15,15,15,15,15,15,15,15,15,15,15,15,15,15,15,15,15,15,15,15,15,15,15,15,15,15,15,15,15,15,15,15,15,15,15,15,15,15,15,15,15,15,15,15,15,15,15,15,15,15,15,15,15,15,15,15,15,15,15,15,15,15,15,15,15,15,15,15,15,15,15,15,15,15,15,15,15,15,15,15,15,15,15,15,15,15,15,15,15,15,15,15,15,15,15,15,15,15,15,15,15,15,15,15,15,15,15,15,15,15,15,15,15,15,15,15,15,15,15,15,15,15,15,15,15,15,15,15,15,15,15,15,15,15,15,15,15,15,15,15,15,15,15,15,15,15,15,15,15,15,15,15,15,15,15,15,15,15,15,15,15,15,15,15,15]
[16,16,16,16,16,16,16,16,16,16,16,16,16,16,16,16,16,16,16,16,16,16,16,16,16,16,16,16,16,16,16,16,16,16,16,16,16,16,16,16,16,16,16,16,16,16,16,16,16,16,16,16,16,16,16,16,16,16,16,16,16,16,16,16,16,16,16,16,16,16,16,16,16,16,16,16,16,16,16,16,16,16,16,16,16,16,16,16,16,16,16,16,16,16,16,16,16,16,16,16,16,16,16,16,16,16,16,16,16,16,16,16,16,16,16,16,16,16,16,16,16,16,16,16,16,16,16,16,16,16,16,16,16,16,16,16,16,16,16,16,16,16,16,16,16,16,16,16,16,16,16,16,16,16,16,16,16,16,16,16,16,16,16,16,16,16,16,16,16,16,16,16,16,16,16,16,16,16,16,16,16,16,16,16,16,16,16,16,16,16,16,16,16,16,16,16,16,16,16,16,16,16,16]
[17,17,17,17,17,17,17,17,17,17,17,17,17,17,17,17,17,17,17,17,17,17,17,17,17,17,17,17,17,17,17,17,17,17,17,17,17,17,17,17,17,17,17,17,17,17,17,17,17,17,17,17,17,17,17,17,17,17,17,17,17,17,17,17,17,17,17,17,17,17,17,17,17,17,17,17,17,17,17,17,17,17,17,17,17,17,17,17,17,17,17,17,17,17,17,17,17,17,17,17,17,17,17,17,17,17,17,17,17,17,17,17,17,17,17,17,17,17,17,17,17,17,17,17,17,17,17,17,17,17,17,17,17,17,17,17,17,17,17,17,17,17,17,17,17,17,17,17,17,17,17,17,17,17,17,17,17,17,17,17,17,17,17,17,17,17,17,17,17,17,17,17,17,17,17,17,17,17,17,17,17,17,17,17,17,17,17,17,17,17,17,17,17,17,17,17,17,17,17,17,17,17,17]
[18,18,18,18,18,18,18,18,18,18,18,18,18,18,18,18,18,18,18,18,18,18,18,18,18,18,18,18,18,18,18,18,18,18,18,18,18,18,18,18,18,18,18,18,18,18,18,18,18,18,18,18,18,18,18,18,18,18,18,18,18,18,18,18,18,18,18,18,18,18,18,18,18,18,18,18,18,18,18,18,18,18,18,18,18,18,18,18,18,18,18,18,18,18,18,18,18,18,18,18,18,18,18,18,18,18,18,18,18,18,18,18,18,18,18,18,18,18,18,18,18,18,18,18,18,18,18,18,18,18,18,18,18,18,18,18,18,18,18,18,18,18,18,18,18,18,18,18,18,18,18,18,18,18,18,18,18,18,18,18,18,18,18,18,18,18,18,18,18,18,18,18,18,18,18,18,18,18,18,18,18,18,18,18,18,18,18,18,18,18,18,18,18,18,18,18,18,18,18,18,18,18,18]
{"$rows_left_out":123}
{"sheet":"Scaling Calculator","index":2,"n_rows":12,"n_cols":6,"rows_kept":12,"cut":false,"hidden":false,"merged":[[2,2,2,4],[1,2,1,4]]}
[]
[null,"Level",null,null,null,"← 1. Select level"]
[null,"Subject",null,null,null,"← 2. Select subject"]
[]
[null,"Qualification ",null,"← 3.Select qualification"]
[null,null,"↓ 4. Enter raw marks"]
[null,"Component","Raw Marks","Scaling Factor","Subject mark for component"]
[null,{"$f":"IFERROR(INDEX(Lookup!$A$1:$D$500,SMALL(IF(Lookup!$A$1:$D$500='Scaling Calculator'!$C$5,ROW(Lookup!$A$1:$D$500)),ROW(1:1))*1,3),\"\")","v":0},null,{"$f":"IFERROR(INDEX(Lookup!$A$1:$D$500,SMALL(IF(Lookup!$A$1:$D$500='Scaling Calculator'!$C$5,ROW(Lookup!$A$1:$D$500)),ROW(1:1))*1,4),\"\")","v":0},{"$f":"IFERROR(C8*D8,\"\")","v":0}]
[null,{"$f":"IFERROR(INDEX(Lookup!$A$1:$D$500,SMALL(IF(Lookup!$A$1:$D$500='Scaling Calculator'!$C$5,ROW(Lookup!$A$1:$D$500)),ROW(2:2))*1,3),\"\")","v":0},null,{"$f":"IFERROR(INDEX(Lookup!$A$1:$D$500,SMALL(IF(Lookup!$A$1:$D$500='Scaling Calculator'!$C$5,ROW(Lookup!$A$1:$D$500)),ROW(2:2))*1,4),\"\")","v":0},{"$f":"IFERROR(C9*D9,\"\")","v":0}]
[null,{"$f":"IFERROR(INDEX(Lookup!$A$1:$D$500,SMALL(IF(Lookup!$A$1:$D$500='Scaling Calculator'!$C$5,ROW(Lookup!$A$1:$D$500)),ROW(3:3))*1,3),\"\")","v":0},null,{"$f":"IFERROR(INDEX(Lookup!$A$1:$D$500,SMALL(IF(Lookup!$A$1:$D$500='Scaling Calculator'!$C$5,ROW(Lookup!$A$1:$D$500)),ROW(3:3))*1,4),\"\")","v":0},{"$f":"IFERROR(C10*D10,\"\")","v":0}]
[null,{"$f":"IFERROR(INDEX(Lookup!$A$1:$D$500,SMALL(IF(Lookup!$A$1:$D$500='Scaling Calculator'!$C$5,ROW(Lookup!$A$1:$D$500)),ROW(4:4))*1,3),\"\")","v":0},null,{"$f":"IFERROR(INDEX(Lookup!$A$1:$D$500,SMALL(IF(Lookup!$A$1:$D$500='Scaling Calculator'!$C$5,ROW(Lookup!$A$1:$D$500)),ROW(4:4))*1,4),\"\")","v":0},{"$f":"IFERROR(C11*D11,\"\")","v":0}]
[null,"Total raw marks",{"$f":"SUM(C8:C11)","v":0},"Total subject marks",{"$f":"SUM(E8:E11)","v":0}]